Reaction Details
TargetSodium channel protein type 9 subunit alpha
LigandBDBM50393019
Substrate/Competitorn/a
Meas. Tech.ChEMBL_853578 (CHEMBL2153996)
Ki 257±n/a nM
Citation Blass, B Substituted pyridines as sodium channel blockers: patent highlight. ACS Med Chem Lett3:695-696 (2012) 
 
Sodium channel protein type 9 subunit alpha
Name:Sodium channel protein type 9 subunit alpha
Type:Protein
Mol. Mass.:226375.97
Organism:Homo sapiens (Human)
Description:Q15858
Residue:1988
BDBM50393019
NameBDBM50393019
Synonyms:CHEMBL2152684 | US9656959, Example 12
TypeSmall organic molecule
Emp. Form.C24H25FN4O3
Mol. Mass.436.4787
SMILESCC(C)C[C@H](NC(N)=O)C(=O)Nc1cccc(n1)-c1ccc(Oc2ccc(F)cc2)cc1