Reaction Details
TargetDNA topoisomerase 4 subunit B
LigandBDBM50393079
Substrate/Competitorn/a
Meas. Tech.ChEMBL_853607 (CHEMBL2154062)
Ki 12±n/a nM
Citation Abdel-Magid, AF Combatting Drug-Resistant Bacteria with Gyrase and Topoisomerase IV Inhibitors: Patent Highlight. ACS Med Chem Lett3:783-784 (2012) 
 
DNA topoisomerase 4 subunit B
Name:DNA topoisomerase 4 subunit B
Type:Enzyme
Mol. Mass.:74365.92
Organism:Staphylococcus aureus
Description:Q2FYS5
Residue:663
BDBM50393079
NameBDBM50393079
Synonyms:CHEMBL2152855 | US9040542, 23
TypeSmall organic molecule
Emp. Form.C21H25FN6O3
Mol. Mass.428.46
SMILESCCNC(=O)Nc1nc2cc(c(F)c([C@H]3CCCO3)c2[nH]1)-c1cnc(nc1)C(C)(C)O