Reaction Details
TargetMicrotubule-associated protein tau
LigandBDBM50393081
Substrate/Competitorn/a
Meas. Tech.ChEMBL_853608 (CHEMBL2154063)
EC50 169±n/a nM
Citation Rotella, DP Novel compounds for the treatment of neurodegenerative diseases: patent highlight. ACS Med Chem Lett3:788-788 (2012) 
 
Microtubule-associated protein tau
Name:Microtubule-associated protein tau
Type:Protein
Mol. Mass.:78928.63
Organism:Homo sapiens (Human)
Description:P10636
Residue:758
BDBM50393081
NameBDBM50393081
Synonyms:CHEMBL2152857
TypeSmall organic molecule
Emp. Form.C24H18ClN3O
Mol. Mass.399.872
SMILESClc1ccc2[nH]cc(CCNC(=O)c3cccc(c3)-c3ccccc3C#N)c2c1