Reaction Details
TargetBeta-secretase 1
LigandBDBM50393102
Substrate/Competitorn/a
Meas. Tech.ChEMBL_853652 (CHEMBL2154189)
IC50 0.560000±n/a nM
Citation Blass, B Compounds and Their Use as BACE Inhibitors: Patent Highlight. ACS Med Chem Lett3:875-876 (2012) 
 
Beta-secretase 1
Name:Beta-secretase 1
Type:Protein
Mol. Mass.:55755.10
Organism:Homo sapiens (Human)
Description:P56817
Residue:501
BDBM50393102
NameBDBM50393102
Synonyms:CHEMBL2152917 US8865911, 20t US8865911, 20t Isomer 2 | US9918985, Example 20t Isomer 1
TypeSmall organic molecule
Emp. Form.C22H31N3O2
Mol. Mass.369.5004
SMILESCO[C@H]1CC[C@@]2(Cc3ccc(OCC(C)C)cc3C22N=C(C)C(N)=N2)CC1