Reaction Details
TargetAlpha-1D adrenergic receptor
LigandBDBM50026917
Substrate/Competitorn/a
Meas. Tech.ChEMBL_852796 (CHEMBL2156103)
Kd 3.02±n/a nM
Citation Romeiro, LAda Silva Ferreira, Mda Silva, LLCastro, HCMiranda, ALSilva, CLNoël, FNascimento, JBAraújo, CVTibiriçá, EBarreiro, EJFraga, CA Discovery of LASSBio-772, a 1,3-benzodioxole N-phenylpiperazine derivative with potent alpha 1A/D-adrenergic receptor blocking properties. Eur J Med Chem46:3000-12 (2011) 
 
Alpha-1D adrenergic receptor
Name:Alpha-1D adrenergic receptor
Type:Protein
Mol. Mass.:59375.97
Organism:Rattus norvegicus (Rat)
Description:P23944
Residue:561
BDBM50026917
NameBDBM50026917
Synonyms:8-(2-(4-(2-methoxyphenyl)piperazin-1-yl)ethyl)-8-azaspiro[4.5]decane-7,9-dione 8-{2-[4-(2-Methoxy-phenyl)-piperazin-1-yl]-ethyl}-8-aza-spiro[4.5]decane-7,9-dione BMY 7378 CHEMBL1256934 CHEMBL543741
TypeSmall organic molecule
Emp. Form.C22H31N3O3
Mol. Mass.385.4998
SMILESCOc1ccccc1N1CCN(CCN2C(=O)CC3(CCCC3)CC2=O)CC1