Reaction Details
TargetAlpha-1A adrenergic receptor
LigandBDBM50393116
Substrate/Competitorn/a
Meas. Tech.ChEMBL_852797 (CHEMBL2156104)
Ki 0.14±n/a nM
Citation Romeiro, LAda Silva Ferreira, Mda Silva, LLCastro, HCMiranda, ALSilva, CLNoël, FNascimento, JBAraújo, CVTibiriçá, EBarreiro, EJFraga, CA Discovery of LASSBio-772, a 1,3-benzodioxole N-phenylpiperazine derivative with potent alpha 1A/D-adrenergic receptor blocking properties. Eur J Med Chem46:3000-12 (2011) 
 
Alpha-1A adrenergic receptor
Name:Alpha-1A adrenergic receptor
Type:Protein
Mol. Mass.:51620.15
Organism:Rattus norvegicus (Rat)
Description:P43140
Residue:466
BDBM50393116
NameBDBM50393116
Synonyms:CHEMBL2153423
TypeSmall organic molecule
Emp. Form.C20H24N2O3
Mol. Mass.340.4162
SMILESCOc1ccccc1N1CCN(CCc2ccc3OCOc3c2)CC1