Reaction Details
TargetSolute carrier family 22 member 2
LigandBDBM50010859
Substrate/Competitorn/a
Meas. Tech.ChEMBL_852936 (CHEMBL2154120)
IC50 600±n/a nM
Citation Kido, YMatsson, PGiacomini, KM Profiling of a prescription drug library for potential renal drug-drug interactions mediated by the organic cation transporter 2. J Med Chem54:4548-58 (2011) 
 
Solute carrier family 22 member 2
Name:Solute carrier family 22 member 2
Type:PROTEIN
Mol. Mass.:62591.01
Organism:Homo sapiens (Human)
Description:ChEMBL_1484077
Residue:555
BDBM50010859
NameBDBM50010859
Synonyms:CHEMBL11 IMIPRAMINE PAMOATE | Imipramin
TypeSmall organic molecule
Emp. Form.C19H24N2
Mol. Mass.280.4073
SMILESCN(C)CCCN1c2ccccc2CCc2ccccc12