Reaction Details
TargetSolute carrier family 22 member 2
LigandBDBM50062614
Substrate/Competitorn/a
Meas. Tech.ChEMBL_852936 (CHEMBL2154120)
IC50 2500±n/a nM
Citation Kido, YMatsson, PGiacomini, KM Profiling of a prescription drug library for potential renal drug-drug interactions mediated by the organic cation transporter 2. J Med Chem54:4548-58 (2011) 
 
Solute carrier family 22 member 2
Name:Solute carrier family 22 member 2
Type:PROTEIN
Mol. Mass.:62591.01
Organism:Homo sapiens (Human)
Description:ChEMBL_1484077
Residue:555
BDBM50062614
NameBDBM50062614
Synonyms:CHEMBL900 Disipal N,N-dimethyl-2-(phenyl(o-tolyl)methoxy)ethanamine Norgesic Orphengesic
TypeSmall organic molecule
Emp. Form.C18H23NO
Mol. Mass.269.3813
SMILESCN(C)CCOC(c1ccccc1)c1ccccc1C