Reaction Details
TargetNeuronal acetylcholine receptor subunit alpha-7
LigandBDBM50393246
Substrate/Competitorn/a
Meas. Tech.ChEMBL_851147 (CHEMBL2157804)
Ki 62±n/a nM
Citation Mazurov, AASpeake, JDYohannes, D Discovery and development ofa7 nicotinic acetylcholine receptor modulators. J Med Chem54:7943-61 (2011) 
 
Neuronal acetylcholine receptor subunit alpha-7
Name:Neuronal acetylcholine receptor subunit alpha-7
Type:Enzyme
Mol. Mass.:56502.44
Organism:Rattus norvegicus (Rat)
Description:Q05941
Residue:502
BDBM50393246
NameBDBM50393246
Synonyms:CHEMBL2151440 US9067931, 130
TypeSmall organic molecule
Emp. Form.C23H24N2O3
Mol. Mass.376.4483
SMILESCOc1ccccc1-c1cccc2cc(oc12)C(=O)N[C@H]1CN2CCC1CC2