Reaction Details
TargetNeuronal acetylcholine receptor subunit alpha-7
LigandBDBM50296742
Substrate/Competitorn/a
Meas. Tech.ChEMBL_851158 (CHEMBL2157815)
Ki 14±n/a nM
Citation Mazurov, AASpeake, JDYohannes, D Discovery and development ofa7 nicotinic acetylcholine receptor modulators. J Med Chem54:7943-61 (2011) 
 
Neuronal acetylcholine receptor subunit alpha-7
Name:Neuronal acetylcholine receptor subunit alpha-7
Type:n/a
Mol. Mass.:56448.33
Organism:Homo sapiens (Human)
Description: CHRNA7 (NACHRA7)
Residue:502
BDBM50296742
NameBDBM50296742
Synonyms:1,4-diazabicyclo[3.2.2]nonane-(4-bromo)-phenyl carbamate | CHEMBL559478
TypeSmall organic molecule
Emp. Form.C14H17BrN2O2
Mol. Mass.325.201
SMILESBrc1ccc(OC(=O)N2CCN3CCC2CC3)cc1