Reaction Details
TargetNeuronal acetylcholine receptor subunit alpha-7
LigandBDBM50393252
Substrate/Competitorn/a
Meas. Tech.ChEMBL_851190 (CHEMBL2157847)
Ki 0.2±n/a nM
Citation Mazurov, AASpeake, JDYohannes, D Discovery and development ofa7 nicotinic acetylcholine receptor modulators. J Med Chem54:7943-61 (2011) 
 
Neuronal acetylcholine receptor subunit alpha-7
Name:Neuronal acetylcholine receptor subunit alpha-7
Type:Enzyme
Mol. Mass.:56502.44
Organism:Rattus norvegicus (Rat)
Description:Q05941
Residue:502
BDBM50393252
NameBDBM50393252
Synonyms:CHEMBL2151570
TypeSmall organic molecule
Emp. Form.C19H20N4O
Mol. Mass.320.3883
SMILESC1CN2CCC1[C@H](C2)Oc1ccc(nn1)-c1ccc2[nH]ccc2c1