Reaction Details
TargetDelta-type opioid receptor
LigandBDBM50393258
Substrate/Competitorn/a
Meas. Tech.ChEMBL_851388 (CHEMBL2156218)
IC50 4.9±n/a nM
Citation Vandormael, BFourla, DDGramowski-Voss, AKosson, PWeiss, DGSchröder, OHLipkowski, AGeorgoussi, ZTourwé, D Superpotent [Dmt¹] dermorphin tetrapeptides containing the 4-aminotetrahydro-2-benzazepin-3-one scaffold with mixedµ/d opioid receptor agonistic properties. J Med Chem54:7848-59 (2011) 
 
Delta-type opioid receptor
Name:Delta-type opioid receptor
Type:G Protein-Coupled Receptor (GPCR)
Mol. Mass.:40465.04
Organism:Rattus norvegicus (rat)
Description:Competition binding assays were using CHO-K1 cell membranes expressing the opioid receptor.
Residue:372
BDBM50393258
NameBDBM50393258
Synonyms:CHEMBL2151734
TypeSmall organic molecule
Emp. Form.C27H37N5O5
Mol. Mass.511.6132
SMILESC[C@@H](N(C)C(=O)[C@@H](N)Cc1c(C)cc(O)cc1C)C(=O)N[C@@H](Cc1ccccc1)C(=O)N(C)CC(N)=O