Reaction Details
TargetcAMP-specific 3',5'-cyclic phosphodiesterase 4A
LigandBDBM50393511
Substrate/Competitorn/a
Meas. Tech.ChEMBL_856427 (CHEMBL2161159)
EC50 15±n/a nM
Citation Day, JPLindsay, BRiddell, TJiang, ZAllcock, RWAbraham, ASookup, SChristian, FBogum, JMartin, EKRae, RLAnthony, DRosair, GMHouslay, DMHuston, EBaillie, GSKlussmann, EHouslay, MDAdams, DR Elucidation of a structural basis for the inhibitor-driven, p62 (SQSTM1)-dependent intracellular redistribution of cAMP phosphodiesterase-4A4 (PDE4A4). J Med Chem54:3331-47 (2011) 
 
cAMP-specific 3',5'-cyclic phosphodiesterase 4A
Name:cAMP-specific 3',5'-cyclic phosphodiesterase 4A
Type:Enzyme
Mol. Mass.:98113.27
Organism:Homo sapiens (Human)
Description:P27815
Residue:886
BDBM50393511
NameBDBM50393511
Synonyms:CHEMBL2158056
TypeSmall organic molecule
Emp. Form.C18H16N4O3
Mol. Mass.336.3446
SMILES[#6]\[#6](-[#6])=[#6]\[#6]-n1nc(-c2cccc(c2)-[#7+](-[#8-])=O)c2ncccc2c1=O