Reaction Details
TargetcAMP-specific 3',5'-cyclic phosphodiesterase 4A
LigandBDBM50042058
Substrate/Competitorn/a
Meas. Tech.ChEMBL_856424 (CHEMBL2161156)
IC50 550±n/a nM
Citation Day, JPLindsay, BRiddell, TJiang, ZAllcock, RWAbraham, ASookup, SChristian, FBogum, JMartin, EKRae, RLAnthony, DRosair, GMHouslay, DMHuston, EBaillie, GSKlussmann, EHouslay, MDAdams, DR Elucidation of a structural basis for the inhibitor-driven, p62 (SQSTM1)-dependent intracellular redistribution of cAMP phosphodiesterase-4A4 (PDE4A4). J Med Chem54:3331-47 (2011) 
 
cAMP-specific 3',5'-cyclic phosphodiesterase 4A
Name:cAMP-specific 3',5'-cyclic phosphodiesterase 4A
Type:Enzyme
Mol. Mass.:98113.27
Organism:Homo sapiens (Human)
Description:P27815
Residue:886
BDBM50042058
NameBDBM50042058
Synonyms:(-)-rolipram (R)-(-)-rolipram CHEMBL430893
TypeSmall organic molecule
Emp. Form.C16H21NO3
Mol. Mass.275.3428
SMILESCOc1ccc(cc1OC1CCCC1)[C@@H]1CNC(=O)C1