Reaction Details
TargetcAMP-specific 3',5'-cyclic phosphodiesterase 4A
LigandBDBM50010981
Substrate/Competitorn/a
Meas. Tech.ChEMBL_856427 (CHEMBL2161159)
EC50 3300±n/a nM
Citation Day, JPLindsay, BRiddell, TJiang, ZAllcock, RWAbraham, ASookup, SChristian, FBogum, JMartin, EKRae, RLAnthony, DRosair, GMHouslay, DMHuston, EBaillie, GSKlussmann, EHouslay, MDAdams, DR Elucidation of a structural basis for the inhibitor-driven, p62 (SQSTM1)-dependent intracellular redistribution of cAMP phosphodiesterase-4A4 (PDE4A4). J Med Chem54:3331-47 (2011) 
 
cAMP-specific 3',5'-cyclic phosphodiesterase 4A
Name:cAMP-specific 3',5'-cyclic phosphodiesterase 4A
Type:Enzyme
Mol. Mass.:98113.27
Organism:Homo sapiens (Human)
Description:P27815
Residue:886
BDBM50010981
NameBDBM50010981
Synonyms:(Ro 20-1724)4-(3-Butoxy-4-methoxy-benzyl)-imidazolidin-2-one 4-(3-Butoxy-4-methoxy-benzyl)-imidazolidin-2-one(Ro 20-1724) CHEMBL18701 Ro-20-1724
TypeSmall organic molecule
Emp. Form.C15H22N2O3
Mol. Mass.278.3468
SMILESCCCCOc1cc(CC2CNC(=O)N2)ccc1OC