Reaction Details
TargetLow molecular weight phosphotyrosine protein phosphatase
LigandBDBM50341993
Substrate/Competitorn/a
Meas. Tech.ChEMBL_857173 (CHEMBL2163147)
IC50 500±n/a nM
Citation Maccari, ROttanà, R Low molecular weight phosphotyrosine protein phosphatases as emerging targets for the design of novel therapeutic agents. J Med Chem55:2-22 (2012) 
 
Low molecular weight phosphotyrosine protein phosphatase
Name:Low molecular weight phosphotyrosine protein phosphatase
Type:n/a
Mol. Mass.:18042.81
Organism:Homo sapiens (Human)
Description:P24666
Residue:158
BDBM50341993
NameBDBM50341993
Synonyms:4-((3-((3-(4-carboxybenzyl)-4-oxo-2-(phenylimino)thiazolidin-5-ylidene)methyl)phenoxy)methyl)benzoic acid | CHEMBL1765349
TypeSmall organic molecule
Emp. Form.C32H24N2O6S
Mol. Mass.564.608
SMILESOC(=O)c1ccc(COc2cccc(\C=C3/S\C(=N/c4ccccc4)N(Cc4ccc(cc4)C(O)=O)C3=O)c2)cc1