Reaction Details
TargetE3 ubiquitin-protein ligase XIAP
LigandBDBM50343522
Substrate/Competitorn/a
Meas. Tech.ChEMBL_855612 (CHEMBL2160283)
Ki 2±n/a nM
Citation Peng, YSun, HLu, JLiu, LCai, QShen, RYang, CYYi, HWang, S Bivalent Smac mimetics with a diazabicyclic core as highly potent antagonists of XIAP and cIAP1/2 and novel anticancer agents. J Med Chem55:106-14 (2012) 
 
E3 ubiquitin-protein ligase XIAP
Name:E3 ubiquitin-protein ligase XIAP
Type:Protein
Mol. Mass.:56685.27
Organism:Homo sapiens (Human)
Description:P98170
Residue:497
BDBM50343522
NameBDBM50343522
Synonyms:(S,3S,3'S,6S,6'S,10aS,10a'S)-N,N'-((1S,1'S)-(1,1'-(4,4'-(1,4-phenylene)bis(butane-4,1-diyl))bis(1H-1,2,3-triazole-4,1-diyl))bis(phenylmethylene))bis(6-((S)-2-(methylamino)propanamido)-5-oxodecahydropyrrolo[1,2-a]azocine-3-carboxamide) | CHEMBL1774154
TypeSmall organic molecule
Emp. Form.C62H84N14O6
Mol. Mass.1121.4206
SMILESCN[C@@H](C)C(=O)N[C@H]1CCCC[C@H]2CC[C@H](N2C1=O)C(=O)N[C@H](c1cn(CCCCc2ccc(CCCCn3cc(nn3)[C@@H](NC(=O)[C@@H]3CC[C@@H]4CCCC[C@H](NC(=O)[C@H](C)NC)C(=O)N34)c3ccccc3)cc2)nn1)c1ccccc1