Reaction Details
TargetBaculoviral IAP repeat-containing protein 2
LigandBDBM50393637
Substrate/Competitorn/a
Meas. Tech.ChEMBL_855617 (CHEMBL2160288)
Ki 1.2±n/a nM
Citation Peng, YSun, HLu, JLiu, LCai, QShen, RYang, CYYi, HWang, S Bivalent Smac mimetics with a diazabicyclic core as highly potent antagonists of XIAP and cIAP1/2 and novel anticancer agents. J Med Chem55:106-14 (2012) 
 
Baculoviral IAP repeat-containing protein 2
Name:Baculoviral IAP repeat-containing protein 2
Type:Protein
Mol. Mass.:69900.47
Organism:Homo sapiens (Human)
Description:Q13490
Residue:618
BDBM50393637
NameBDBM50393637
Synonyms:CHEMBL2158606
TypeSmall organic molecule
Emp. Form.C64H84N10O9
Mol. Mass.1137.4134
SMILESCN[C@@H](C)C(=O)N[C@H]1CN(CC[C@H]2CC[C@H](N2C1=O)C(=O)NC(c1ccccc1)c1ccccc1)C(=O)CCCCOCCCCC(=O)N1CC[C@H]2CC[C@H](N2C(=O)[C@H](C1)NC(=O)[C@H](C)NC)C(=O)NC(c1ccccc1)c1ccccc1