Reaction Details
TargetDelta-type opioid receptor
LigandBDBM50154036
Substrate/Competitorn/a
Meas. Tech.ChEMBL_856832 (CHEMBL2163097)
EC50 19±n/a nM
Citation Breslin, HJDiamond, CJKavash, RWCai, CDyatkin, ABMiskowski, TAZhang, SPWade, PRHornby, PJHe, W Identification of a duald OR antagonist/µ OR agonist as a potential therapeutic for diarrhea-predominant Irritable Bowel Syndrome (IBS-d). Bioorg Med Chem Lett22:4869-72 (2012) 
 
Delta-type opioid receptor
Name:Delta-type opioid receptor
Type:G Protein-Coupled Receptor (GPCR)
Mol. Mass.:40382.98
Organism:Homo sapiens (Human)
Description:Competition binding assays were carried out using membrane preparations from transfected HN9.10 cells that constitutively expressed the delta opioid receptor.
Residue:372
BDBM50154036
NameBDBM50154036
Synonyms:(S)-2-amino-3-(4-hydroxyphenyl)-1-((S)-3-(4-phenyl-1H-imidazol-2-yl)-3,4-dihydroisoquinolin-2(1H)-yl)propan-1-one CHEMBL361274
TypeSmall organic molecule
Emp. Form.C27H26N4O2
Mol. Mass.438.5209
SMILESN[C@@H](Cc1ccc(O)cc1)C(=O)N1Cc2ccccc2C[C@H]1c1nc(c[nH]1)-c1ccccc1