Reaction Details
TargetMu-type opioid receptor
LigandBDBM50182946
Substrate/Competitorn/a
Meas. Tech.ChEMBL_856831 (CHEMBL2163096)
Ki 0.130000±n/a nM
Citation Breslin, HJDiamond, CJKavash, RWCai, CDyatkin, ABMiskowski, TAZhang, SPWade, PRHornby, PJHe, W Identification of a duald OR antagonist/µ OR agonist as a potential therapeutic for diarrhea-predominant Irritable Bowel Syndrome (IBS-d). Bioorg Med Chem Lett22:4869-72 (2012) 
 
Mu-type opioid receptor
Name:Mu-type opioid receptor
Type:G Protein-Coupled Receptor (GPCR)
Mol. Mass.:44503.11
Organism:Rattus norvegicus (rat)
Description:Competition binding assays were carried out using membrane preparations from transfected HN9.10 cells that constitutively expressed the mu opioid receptor.
Residue:398
BDBM50182946
NameBDBM50182946
Synonyms:4-((S)-2-amino-3-oxo-3-((S)-2-(4-phenyl-1H-imidazol-2-yl)piperidin-1-yl)propyl)-3,5-dimethylbenzamide | CHEMBL205049
TypeSmall organic molecule
Emp. Form.C26H31N5O2
Mol. Mass.445.5566
SMILESCc1cc(cc(C)c1C[C@H](N)C(=O)N1CCCC[C@H]1c1nc(c[nH]1)-c1ccccc1)C(N)=O