Reaction Details
TargetAndrogen receptor
LigandBDBM50393807
Substrate/Competitorn/a
Meas. Tech.ChEMBL_854887 (CHEMBL2162624)
IC50 10964.78±n/a nM
Citation Poutiainen, PKOravilahti, TPeräkylä, MPalvimo, JJIhalainen, JALaatikainen, RPulkkinen, JT Design, synthesis, and biological evaluation of nonsteroidal cycloalkane[d]isoxazole-containing androgen receptor modulators. J Med Chem55:6316-27 (2012) 
 
Androgen receptor
Name:Androgen receptor
Type:Receptor
Mol. Mass.:99185.27
Organism:Homo sapiens (Human)
Description:CHO cells were stably transfected with human AR gene.
Residue:920
BDBM50393807
NameBDBM50393807
Synonyms:CHEMBL2159543
TypeSmall organic molecule
Emp. Form.C15H15F4NO
Mol. Mass.301.2793
SMILESFc1ccc(cc1C(F)(F)F)C1=NOC2CCCCCC12