Reaction Details
TargetAndrogen receptor
LigandBDBM50393811
Substrate/Competitorn/a
Meas. Tech.ChEMBL_854887 (CHEMBL2162624)
IC50 999±n/a nM
Citation Poutiainen, PKOravilahti, TPeräkylä, MPalvimo, JJIhalainen, JALaatikainen, RPulkkinen, JT Design, synthesis, and biological evaluation of nonsteroidal cycloalkane[d]isoxazole-containing androgen receptor modulators. J Med Chem55:6316-27 (2012) 
 
Androgen receptor
Name:Androgen receptor
Type:Receptor
Mol. Mass.:99185.27
Organism:Homo sapiens (Human)
Description:CHO cells were stably transfected with human AR gene.
Residue:920
BDBM50393811
NameBDBM50393811
Synonyms:CHEMBL2159539
TypeSmall organic molecule
Emp. Form.C16H15F3N2O
Mol. Mass.308.2983
SMILESFC(F)(F)c1cc(ccc1C1=NOC2CCCCCC12)C#N