Reaction Details
TargetAndrogen receptor
LigandBDBM50393813
Substrate/Competitorn/a
Meas. Tech.ChEMBL_854887 (CHEMBL2162624)
IC50 43.65±n/a nM
Citation Poutiainen, PKOravilahti, TPeräkylä, MPalvimo, JJIhalainen, JALaatikainen, RPulkkinen, JT Design, synthesis, and biological evaluation of nonsteroidal cycloalkane[d]isoxazole-containing androgen receptor modulators. J Med Chem55:6316-27 (2012) 
 
Androgen receptor
Name:Androgen receptor
Type:Receptor
Mol. Mass.:99185.27
Organism:Homo sapiens (Human)
Description:CHO cells were stably transfected with human AR gene.
Residue:920
BDBM50393813
NameBDBM50393813
Synonyms:CHEMBL2159561
TypeSmall organic molecule
Emp. Form.C16H15F3N2O
Mol. Mass.308.2983
SMILESFC(F)(F)c1cc(ccc1C#N)C1=NOC2CCCCCC12