Reaction Details
TargetAndrogen receptor
LigandBDBM50393822
Substrate/Competitorn/a
Meas. Tech.ChEMBL_854887 (CHEMBL2162624)
IC50 1540±n/a nM
Citation Poutiainen, PKOravilahti, TPeräkylä, MPalvimo, JJIhalainen, JALaatikainen, RPulkkinen, JT Design, synthesis, and biological evaluation of nonsteroidal cycloalkane[d]isoxazole-containing androgen receptor modulators. J Med Chem55:6316-27 (2012) 
 
Androgen receptor
Name:Androgen receptor
Type:Receptor
Mol. Mass.:99185.27
Organism:Homo sapiens (Human)
Description:CHO cells were stably transfected with human AR gene.
Residue:920
BDBM50393822
NameBDBM50393822
Synonyms:CHEMBL2159565
TypeSmall organic molecule
Emp. Form.C13H11F4NO
Mol. Mass.273.2262
SMILESFc1ccc(C2=NOC3CCCC23)c(c1)C(F)(F)F