Reaction Details
TargetAndrogen receptor
LigandBDBM50393825
Substrate/Competitorn/a
Meas. Tech.ChEMBL_854887 (CHEMBL2162624)
IC50 302±n/a nM
Citation Poutiainen, PKOravilahti, TPeräkylä, MPalvimo, JJIhalainen, JALaatikainen, RPulkkinen, JT Design, synthesis, and biological evaluation of nonsteroidal cycloalkane[d]isoxazole-containing androgen receptor modulators. J Med Chem55:6316-27 (2012) 
 
Androgen receptor
Name:Androgen receptor
Type:Receptor
Mol. Mass.:99185.27
Organism:Homo sapiens (Human)
Description:CHO cells were stably transfected with human AR gene.
Residue:920
BDBM50393825
NameBDBM50393825
Synonyms:CHEMBL2159562
TypeSmall organic molecule
Emp. Form.C13H11F3N2O3
Mol. Mass.300.2332
SMILES[O-][N+](=O)c1ccc(cc1C(F)(F)F)C1=NO[C@@H]2CCC[C@H]12