Reaction Details
TargetAndrogen receptor
LigandBDBM35909
Substrate/Competitorn/a
Meas. Tech.ChEMBL_854887 (CHEMBL2162624)
IC50 223.87±n/a nM
Citation Poutiainen, PKOravilahti, TPeräkylä, MPalvimo, JJIhalainen, JALaatikainen, RPulkkinen, JT Design, synthesis, and biological evaluation of nonsteroidal cycloalkane[d]isoxazole-containing androgen receptor modulators. J Med Chem55:6316-27 (2012) 
 
Androgen receptor
Name:Androgen receptor
Type:Receptor
Mol. Mass.:99185.27
Organism:Homo sapiens (Human)
Description:CHO cells were stably transfected with human AR gene.
Residue:920
BDBM35909
NameBDBM35909
Synonyms:2-Hydroxy-2-methyl-N-(4-nitro-3-trifluoromethyl-phenyl)-propionamide 2-Hydroxy-2-methyl-N-(4-nitro-3-trifluoromethyl-phenyl)-propionamide(Hydroxyflutamide) CHEMBL491 Hydroxyflutamide Sch 16423 cid_91649 | hydroxy-flutamide
TypeSmall organic molecule
Emp. Form.C11H11F3N2O4
Mol. Mass.292.2112
SMILESCC(C)(O)C(=O)Nc1ccc(c(c1)C(F)(F)F)[N+]([O-])=O