Reaction Details
TargetPhosphatidylinositol 4,5-bisphosphate 3-kinase catalytic subunit beta isoform
LigandBDBM50393984
Substrate/Competitorn/a
Meas. Tech.ChEMBL_855896 (CHEMBL2161659)
IC50 93±n/a nM
Citation Giordanetto, FWållberg, ACassel, JGhosal, SKossenjans, MYuan, ZQWang, XLiang, L Discovery of 4-morpholino-pyrimidin-6-one and 4-morpholino-pyrimidin-2-one-containing Phosphoinositide 3-kinase (PI3K) p110ß isoform inhibitors through structure-based fragment optimisation. Bioorg Med Chem Lett22:6665-70 (2012) 
 
Phosphatidylinositol 4,5-bisphosphate 3-kinase catalytic subunit beta isoform
Name:Phosphatidylinositol 4,5-bisphosphate 3-kinase catalytic subunit beta isoform
Type:Enzyme Subunit
Mol. Mass.:122769.00
Organism:Homo sapiens (Human)
Description:P42338
Residue:1070
BDBM50393984
NameBDBM50393984
Synonyms:CHEMBL2158436
TypeSmall organic molecule
Emp. Form.C19H20N4O2
Mol. Mass.336.3877
SMILESO=c1cc(nc(NCc2cccc3ccccc23)[nH]1)N1CCOCC1