Reaction Details
TargetDelta-type opioid receptor
LigandBDBM50394031
Substrate/Competitorn/a
Meas. Tech.ChEMBL_856078 (CHEMBL2162312)
Ki>5000±n/a nM
Citation Javor, SJanowsky, AJohnson, RWolfrum, KTadayoni-Rebek, MRebek, J Formylated polyamines as peptidomimetics. Bioorg Med Chem Lett22:6580-2 (2012) 
 
Delta-type opioid receptor
Name:Delta-type opioid receptor
Type:G Protein-Coupled Receptor (GPCR)
Mol. Mass.:40382.98
Organism:Homo sapiens (Human)
Description:Competition binding assays were carried out using membrane preparations from transfected HN9.10 cells that constitutively expressed the delta opioid receptor.
Residue:372
BDBM50394031
NameBDBM50394031
Synonyms:CHEMBL2158541
TypeSmall organic molecule
Emp. Form.C33H50N6O7S
Mol. Mass.674.851
SMILESCC(C)C[C@H](CN(C=O)[C@@H](CN(CCN(CCN(C=O)[C@@H](CN)Cc1ccc(O)cc1)C=O)C=O)Cc1ccccc1)NS(C)(=O)=O