Reaction Details
TargetD(3) dopamine receptor
LigandBDBM50325822
Substrate/Competitorn/a
Meas. Tech.ChEMBL_856120 (CHEMBL2162508)
Ki 210±n/a nM
Citation Clark, AHMcCorvy, JDConley, JMWilliams, WKBekkam, MWatts, VJNichols, DE Identification of a 2-phenyl-substituted octahydrobenzo[f]quinoline as a dopamine D3 receptor-selective full agonist ligand. Bioorg Med Chem20:6366-74 (2012) 
 
D(3) dopamine receptor
Name:D(3) dopamine receptor
Type:n/a
Mol. Mass.:44243.43
Organism:Homo sapiens (Human)
Description:n/a
Residue:400
BDBM50325822
NameBDBM50325822
Synonyms:CHEMBL1224527 | trans-(5R)-5-phenyl-1,2,3,4,4a,5,6,10b-octahydrobenzo[h]isoquinoline-7,8-diol
TypeSmall organic molecule
Emp. Form.C19H21NO2
Mol. Mass.295.3755
SMILESOc1ccc2[C@@H]3CNCC[C@H]3[C@@H](Cc2c1O)c1ccccc1