Reaction Details
TargetPotassium voltage-gated channel subfamily H member 2
LigandBDBM50394147
Substrate/Competitorn/a
Meas. Tech.ChEMBL_856368 (CHEMBL2160723)
IC50 12589.25±n/a nM
Citation Bahl, ABarton, PBowers, KCaffrey, MVDenton, RGilmour, PHawley, SLinannen, TLuckhurst, CAMochel, TPerry, MWRiley, RJRoe, ESpringthorpe, BStein, LWebborn, P Scaffold-hopping with zwitterionic CCR3 antagonists: identification and optimisation of a series with good potency and pharmacokinetics leading to the discovery of AZ12436092. Bioorg Med Chem Lett22:6694-9 (2012) 
 
Potassium voltage-gated channel subfamily H member 2
Name:Potassium voltage-gated channel subfamily H member 2
Type:Multi-pass membrane protein
Mol. Mass.:126672.65
Organism:Homo sapiens (Human)
Description:Q12809
Residue:1159
BDBM50394147
NameBDBM50394147
Synonyms:CHEMBL2158825
TypeSmall organic molecule
Emp. Form.C25H30Cl2N2O3
Mol. Mass.477.423
SMILESOC(=O)Cc1ccccc1N1CCC(CN2CCC(CC2)Oc2ccc(Cl)c(Cl)c2)CC1