Reaction Details
TargetHistamine H1 receptor
LigandBDBM50394113
Substrate/Competitorn/a
Meas. Tech.ChEMBL_856370 (CHEMBL2160725)
Ki 50.12±n/a nM
Citation Bahl, ABarton, PBowers, KCaffrey, MVDenton, RGilmour, PHawley, SLinannen, TLuckhurst, CAMochel, TPerry, MWRiley, RJRoe, ESpringthorpe, BStein, LWebborn, P Scaffold-hopping with zwitterionic CCR3 antagonists: identification and optimisation of a series with good potency and pharmacokinetics leading to the discovery of AZ12436092. Bioorg Med Chem Lett22:6694-9 (2012) 
 
Histamine H1 receptor
Name:Histamine H1 receptor
Type:G Protein-Coupled Receptor (GPCR)
Mol. Mass.:55808.72
Organism:Homo sapiens (Human)
Description:Cell pellets from SK-N-MC cells transfected with human H1 receptor were used in binding assay.
Residue:487
BDBM50394113
NameBDBM50394113
Synonyms:CHEMBL2158792
TypeSmall organic molecule
Emp. Form.C28H36ClFN2O3
Mol. Mass.503.048
SMILESCc1cc(OC2CCN(CC3CCN(CC3)[C@@](C)(Cc3ccc(F)cc3)C(O)=O)CC2)ccc1Cl