Reaction Details
TargetHistamine H1 receptor
LigandBDBM50394125
Substrate/Competitorn/a
Meas. Tech.ChEMBL_856370 (CHEMBL2160725)
Ki 63.1±n/a nM
Citation Bahl, ABarton, PBowers, KCaffrey, MVDenton, RGilmour, PHawley, SLinannen, TLuckhurst, CAMochel, TPerry, MWRiley, RJRoe, ESpringthorpe, BStein, LWebborn, P Scaffold-hopping with zwitterionic CCR3 antagonists: identification and optimisation of a series with good potency and pharmacokinetics leading to the discovery of AZ12436092. Bioorg Med Chem Lett22:6694-9 (2012) 
 
Histamine H1 receptor
Name:Histamine H1 receptor
Type:G Protein-Coupled Receptor (GPCR)
Mol. Mass.:55808.72
Organism:Homo sapiens (Human)
Description:Cell pellets from SK-N-MC cells transfected with human H1 receptor were used in binding assay.
Residue:487
BDBM50394125
NameBDBM50394125
Synonyms:CHEMBL2158775
TypeSmall organic molecule
Emp. Form.C27H34Cl2N2O4
Mol. Mass.521.476
SMILESCOc1ccccc1C[C@H](N1CCC(CN2CCC(CC2)Oc2ccc(Cl)c(Cl)c2)CC1)C(O)=O