Reaction Details
TargetHistamine H1 receptor
LigandBDBM50394131
Substrate/Competitorn/a
Meas. Tech.ChEMBL_856370 (CHEMBL2160725)
Ki 15.85±n/a nM
Citation Bahl, ABarton, PBowers, KCaffrey, MVDenton, RGilmour, PHawley, SLinannen, TLuckhurst, CAMochel, TPerry, MWRiley, RJRoe, ESpringthorpe, BStein, LWebborn, P Scaffold-hopping with zwitterionic CCR3 antagonists: identification and optimisation of a series with good potency and pharmacokinetics leading to the discovery of AZ12436092. Bioorg Med Chem Lett22:6694-9 (2012) 
 
Histamine H1 receptor
Name:Histamine H1 receptor
Type:G Protein-Coupled Receptor (GPCR)
Mol. Mass.:55808.72
Organism:Homo sapiens (Human)
Description:Cell pellets from SK-N-MC cells transfected with human H1 receptor were used in binding assay.
Residue:487
BDBM50394131
NameBDBM50394131
Synonyms:CHEMBL2158769
TypeSmall organic molecule
Emp. Form.C27H31Cl2N3O3
Mol. Mass.516.459
SMILESOC(=O)[C@H](Cc1ccccc1C#N)N1CCC(CN2CCC(CC2)Oc2ccc(Cl)c(Cl)c2)CC1