Reaction Details
TargetC-C chemokine receptor type 3
LigandBDBM50394129
Substrate/Competitorn/a
Meas. Tech.ChEMBL_856369 (CHEMBL2160724)
Ki 7.94±n/a nM
Citation Bahl, ABarton, PBowers, KCaffrey, MVDenton, RGilmour, PHawley, SLinannen, TLuckhurst, CAMochel, TPerry, MWRiley, RJRoe, ESpringthorpe, BStein, LWebborn, P Scaffold-hopping with zwitterionic CCR3 antagonists: identification and optimisation of a series with good potency and pharmacokinetics leading to the discovery of AZ12436092. Bioorg Med Chem Lett22:6694-9 (2012) 
 
C-C chemokine receptor type 3
Name:C-C chemokine receptor type 3
Type:Enzyme
Mol. Mass.:41053.88
Organism:Homo sapiens (Human)
Description:P51677
Residue:355
BDBM50394129
NameBDBM50394129
Synonyms:CHEMBL2158771
TypeSmall organic molecule
Emp. Form.C27H31Cl2N3O3
Mol. Mass.516.459
SMILESOC(=O)[C@H](Cc1ccc(cc1)C#N)N1CCC(CN2CCC(CC2)Oc2ccc(Cl)c(Cl)c2)CC1