Reaction Details
TargetSmoothened homolog
LigandBDBM50394395
Substrate/Competitorn/a
Meas. Tech.ChEMBL_854592 (CHEMBL2161253)
IC50 0.2±n/a nM
Citation Cheng, DHan, DGao, WJing, QJiang, JWan, YEnglund, NPTuntland, TWu, XPan, S Design, synthesis, and structure-activity-relationship of phenyl imidazoles as potent Smoothened antagonists. Bioorg Med Chem Lett22:6573-6 (2012) 
 
Smoothened homolog
Name:Smoothened homolog
Type:PROTEIN
Mol. Mass.:87472.73
Organism:Mus musculus
Description:ChEMBL_1510377
Residue:793
BDBM50394395
NameBDBM50394395
Synonyms:CHEMBL2160078
TypeSmall organic molecule
Emp. Form.C27H26N4O2
Mol. Mass.438.5209
SMILESCc1ccc(NC(=O)c2ccc(cc2)N2CCOCC2)cc1-c1nc(c[nH]1)-c1ccccc1