Reaction Details
TargetSmoothened homolog
LigandBDBM50394397
Substrate/Competitorn/a
Meas. Tech.ChEMBL_854596 (CHEMBL2161257)
IC50 4±n/a nM
Citation Cheng, DHan, DGao, WJing, QJiang, JWan, YEnglund, NPTuntland, TWu, XPan, S Design, synthesis, and structure-activity-relationship of phenyl imidazoles as potent Smoothened antagonists. Bioorg Med Chem Lett22:6573-6 (2012) 
 
Smoothened homolog
Name:Smoothened homolog
Type:Protein
Mol. Mass.:86415.51
Organism:Homo sapiens (Human)
Description:Q99835
Residue:787
BDBM50394397
NameBDBM50394397
Synonyms:CHEMBL2160067
TypeSmall organic molecule
Emp. Form.C28H25ClN6O
Mol. Mass.496.991
SMILESC[C@@H]1CN(CCO1)c1ccc2c(Nc3ccc(Cl)c(c3)-c3nc(c[nH]3)-c3ccccc3)nccc2n1