Reaction Details
TargetSmoothened homolog
LigandBDBM50394403
Substrate/Competitorn/a
Meas. Tech.ChEMBL_854593 (CHEMBL2161254)
IC50 1.6±n/a nM
Citation Cheng, DHan, DGao, WJing, QJiang, JWan, YEnglund, NPTuntland, TWu, XPan, S Design, synthesis, and structure-activity-relationship of phenyl imidazoles as potent Smoothened antagonists. Bioorg Med Chem Lett22:6573-6 (2012) 
 
Smoothened homolog
Name:Smoothened homolog
Type:PROTEIN
Mol. Mass.:87472.73
Organism:Mus musculus
Description:ChEMBL_1510377
Residue:793
BDBM50394403
NameBDBM50394403
Synonyms:CHEMBL2160074
TypeSmall organic molecule
Emp. Form.C29H26ClN5O
Mol. Mass.496.003
SMILESC[C@@H]1CN(CCO1)c1ccc2c(Nc3ccc(Cl)c(c3)-c3nc(c[nH]3)-c3ccccc3)nccc2c1