Reaction Details
TargetPotassium voltage-gated channel subfamily H member 2
LigandBDBM50394586
Substrate/Competitorn/a
Meas. Tech.ChEMBL_857606 (CHEMBL2168044)
IC50>50000±n/a nM
Citation Skerlj, RBridger, GZhou, YBourque, EMcEachern, EDanthi, SLangille, JHarwig, CVeale, DCarpenter, BBa, TBey, MBaird, IWilson, TMetz, MMacFarland, RMosi, RBodart, VWong, RFricker, SHuskens, DSchols, D Mitigating hERG Inhibition: Design of Orally Bioavailable CCR5 Antagonists as Potent Inhibitors of R5 HIV-1 Replication. ACS Med Chem Lett3:216-221 (2012) 
 
Potassium voltage-gated channel subfamily H member 2
Name:Potassium voltage-gated channel subfamily H member 2
Type:Multi-pass membrane protein
Mol. Mass.:126672.65
Organism:Homo sapiens (Human)
Description:Q12809
Residue:1159
BDBM50394586
NameBDBM50394586
Synonyms:CHEMBL2164212
TypeSmall organic molecule
Emp. Form.C31H38ClN5O4S
Mol. Mass.612.183
SMILESC[C@H](CCNC(=O)c1c(C)cc(Cl)nc1C)N1CCC(CC1)N(Cc1ccsc1)C(=O)NCc1ccc(cc1)C(O)=O