Reaction Details
TargetATP-citrate synthase
LigandBDBM50394668
Substrate/Competitorn/a
Meas. Tech.ChEMBL_857792 (CHEMBL2169035)
Ki 220±n/a nM
Citation Abramson, HN The lipogenesis pathway as a cancer target. J Med Chem54:5615-38 (2011) 
 
ATP-citrate synthase
Name:ATP-citrate synthase
Type:PROTEIN
Mol. Mass.:120848.43
Organism:Homo sapiens (Human)
Description:ChEMBL_455196
Residue:1101
BDBM50394668
NameBDBM50394668
Synonyms:CHEMBL2163366
TypeSmall organic molecule
Emp. Form.C24H27ClO6
Mol. Mass.446.921
SMILESO[C@@H](CCCCCC1c2ccccc2-c2cc(Cl)ccc12)C[C@@](O)(CC(O)=O)C(O)=O