Reaction Details
TargetATP-citrate synthase
LigandBDBM50394671
Substrate/Competitorn/a
Meas. Tech.ChEMBL_857792 (CHEMBL2169035)
Ki 340±n/a nM
Citation Abramson, HN The lipogenesis pathway as a cancer target. J Med Chem54:5615-38 (2011) 
 
ATP-citrate synthase
Name:ATP-citrate synthase
Type:PROTEIN
Mol. Mass.:120848.43
Organism:Homo sapiens (Human)
Description:ChEMBL_455196
Residue:1101
BDBM50394671
NameBDBM50394671
Synonyms:CHEMBL2165260
TypeSmall organic molecule
Emp. Form.C24H32ClNO6
Mol. Mass.465.967
SMILESCc1cn(cc1C)-c1cc(Cl)ccc1CCCCCC[C@H](O)C[C@@](O)(CC(O)=O)C(O)=O