Reaction Details
TargetATP-citrate synthase
LigandBDBM50066683
Substrate/Competitorn/a
Meas. Tech.ChEMBL_857792 (CHEMBL2169035)
Ki 1000±n/a nM
Citation Abramson, HN The lipogenesis pathway as a cancer target. J Med Chem54:5615-38 (2011) 
 
ATP-citrate synthase
Name:ATP-citrate synthase
Type:PROTEIN
Mol. Mass.:120848.43
Organism:Homo sapiens (Human)
Description:ChEMBL_455196
Residue:1101
BDBM50066683
NameBDBM50066683
Synonyms:(S)-2-((R)-8-(2,4-dichlorophenyl)-2-hydroxyoctyl)-2-hydroxysuccinic acid CHEMBL119628
TypeSmall organic molecule
Emp. Form.C18H24Cl2O6
Mol. Mass.407.286
SMILESO[C@H](CCCCCCc1ccc(Cl)cc1Cl)C[C@](O)(CC(O)=O)C(O)=O