Reaction Details
TargetNeuronal acetylcholine receptor subunit alpha-7
LigandBDBM50394679
Substrate/Competitorn/a
Meas. Tech.ChEMBL_857457 (CHEMBL2166950)
Ki 2890±n/a nM
Citation Yu, LFTückmantel, WEaton, JBCaldarone, BFedolak, AHanania, TBrunner, DLukas, RJKozikowski, AP Identification of novela4ß2-nicotinic acetylcholine receptor (nAChR) agonists based on an isoxazole ether scaffold that demonstrate antidepressant-like activity. J Med Chem55:812-23 (2012) 
 
Neuronal acetylcholine receptor subunit alpha-7
Name:Neuronal acetylcholine receptor subunit alpha-7
Type:Enzyme
Mol. Mass.:56502.44
Organism:Rattus norvegicus (Rat)
Description:Q05941
Residue:502
BDBM50394679
NameBDBM50394679
Synonyms:CHEMBL2165444
TypeSmall organic molecule
Emp. Form.C8H12N2O2
Mol. Mass.168.1931
SMILESCc1cc(OC[C@@H]2CCN2)on1