Reaction Details
TargetDiacylglycerol O-acyltransferase 1
LigandBDBM50394726
Substrate/Competitorn/a
Meas. Tech.ChEMBL_859008 (CHEMBL2168630)
IC50 8±n/a nM
Citation Yeh, VSBeno, DWBrodjian, SBrune, MECullen, SCDayton, BDDhaon, MKFalls, HDGao, JGrihalde, NHajduk, PHansen, TMJudd, ASKing, AJKlix, RCLarson, KJLau, YYMarsh, KCMittelstadt, SWPlata, DRozema, MJSegreti, JAStoner, EJVoorbach, MJWang, XXin, XZhao, GCollins, CACox, BFReilly, RMKym, PRSouers, AJ Identification and preliminary characterization of a potent, safe, and orally efficacious inhibitor of acyl-CoA:diacylglycerol acyltransferase 1. J Med Chem55:1751-7 (2012) 
 
Diacylglycerol O-acyltransferase 1
Name:Diacylglycerol O-acyltransferase 1
Type:Enzyme
Mol. Mass.:56810.61
Organism:Mus musculus (mouse)
Description:In this assay, recombinant mouse DGAT-1 containing an N-terminal His6-epitope tag was produced in the baculovirus expression system.
Residue:498
BDBM50394726
NameBDBM50394726
Synonyms:CHEMBL2165819
TypeSmall organic molecule
Emp. Form.C20H22N4O2
Mol. Mass.350.4143
SMILESNc1c(cnc2ccnn12)-c1ccc(cc1)[C@H]1CC[C@H](CC(O)=O)CC1