Reaction Details
TargetPotassium voltage-gated channel subfamily H member 2
LigandBDBM50394741
Substrate/Competitorn/a
Meas. Tech.ChEMBL_859035 (CHEMBL2168855)
EC50>30000±n/a nM
Citation Ramnauth, JRenton, PDove, PAnnedi, SCSpeed, JSilverman, SMladenova, GMaddaford, SPZinghini, SRakhit, SAndrews, JLee, DKZhang, DPorreca, F 1,2,3,4-tetrahydroquinoline-based selective human neuronal nitric oxide synthase (nNOS) inhibitors: lead optimization studies resulting in the identification of N-(1-(2-(methylamino)ethyl)-1,2,3,4-tetrahydroquinolin-6-yl)thiophene-2-carboximidamide as a preclinical development candidate. J Med Chem55:2882-93 (2012) 
 
Potassium voltage-gated channel subfamily H member 2
Name:Potassium voltage-gated channel subfamily H member 2
Type:Multi-pass membrane protein
Mol. Mass.:126672.65
Organism:Homo sapiens (Human)
Description:Q12809
Residue:1159
BDBM50394741
NameBDBM50394741
Synonyms:CHEMBL2165825
TypeSmall organic molecule
Emp. Form.C18H24N4S
Mol. Mass.328.475
SMILESCCNCCN1CCCc2cc(NC(=N)c3cccs3)ccc12