Reaction Details
TargetLanosterol synthase
LigandBDBM50255473
Substrate/Competitorn/a
Meas. Tech.ChEMBL_860118 (CHEMBL2168444)
IC50 17.8±n/a nM
Citation Staedler, DChapuis-Bernasconi, CDehmlow, HFischer, HJuillerat-Jeanneret, LAebi, JD Cytotoxic effects of combination of oxidosqualene cyclase inhibitors with atorvastatin in human cancer cells. J Med Chem55:4990-5002 (2012) 
 
Lanosterol synthase
Name:Lanosterol synthase
Type:PROTEIN
Mol. Mass.:83309.32
Organism:Homo sapiens (Human)
Description:ChEMBL_11231
Residue:732
BDBM50255473
NameBDBM50255473
Synonyms:2-((4-(3-(4-bromophenyl)benzo[d]isothiazol-6-yloxy)butyl)(ethyl)amino)ethanol hydrochloride | CHEMBL479464
TypeSmall organic molecule
Emp. Form.C21H25BrN2O2S
Mol. Mass.449.404
SMILESCCN(CCO)CCCCOc1ccc2c(nsc2c1)-c1ccc(Br)cc1