Reaction Details
TargetSolute carrier organic anion transporter family member 1B1
LigandBDBM50394837
Substrate/Competitorn/a
Meas. Tech.ChEMBL_860286 (CHEMBL2169432)
IC50 19000±n/a nM
Citation Karlgren, MVildhede, ANorinder, UWisniewski, JRKimoto, ELai, YHaglund, UArtursson, P Classification of inhibitors of hepatic organic anion transporting polypeptides (OATPs): influence of protein expression on drug-drug interactions. J Med Chem55:4740-63 (2012) 
 
Solute carrier organic anion transporter family member 1B1
Name:Solute carrier organic anion transporter family member 1B1
Type:Protein
Mol. Mass.:76468.06
Organism:Homo sapiens (Human)
Description:Q9Y6L6
Residue:691
BDBM50394837
NameBDBM50394837
Synonyms:CHEMBL343002 | HOE-33342
TypeSmall organic molecule
Emp. Form.C27H28N6O
Mol. Mass.452.5508
SMILESCCOc1ccc(cc1)-c1nc2ccc(cc2[nH]1)-c1nc2ccc(cc2[nH]1)N1CCN(C)CC1