Reaction Details
TargetSolute carrier organic anion transporter family member 1B1
LigandBDBM50139772
Substrate/Competitorn/a
Meas. Tech.ChEMBL_860286 (CHEMBL2169432)
IC50 44000±n/a nM
Citation Karlgren, MVildhede, ANorinder, UWisniewski, JRKimoto, ELai, YHaglund, UArtursson, P Classification of inhibitors of hepatic organic anion transporting polypeptides (OATPs): influence of protein expression on drug-drug interactions. J Med Chem55:4740-63 (2012) 
 
Solute carrier organic anion transporter family member 1B1
Name:Solute carrier organic anion transporter family member 1B1
Type:Protein
Mol. Mass.:76468.06
Organism:Homo sapiens (Human)
Description:Q9Y6L6
Residue:691
BDBM50139772
NameBDBM50139772
Synonyms:22-oxovincaleukoblastine vincristine
TypeSmall organic molecule
Emp. Form.C46H56N4O10
Mol. Mass.824.9576
SMILESCC[C@]1(O)C[C@H]2CN(C1)CCc1c([nH]c3ccccc13)[C@@](C2)(C(=O)OC)c1cc2c(cc1OC)N(C=O)[C@@H]1[C@]22CCN3CC=C[C@](CC)([C@@H]23)[C@@H](OC(C)=O)[C@]1(O)C(=O)OC