Reaction Details
TargetSerine/threonine-protein kinase mTOR
LigandBDBM50394844
Substrate/Competitorn/a
Meas. Tech.ChEMBL_860331 (CHEMBL2169664)
IC50>10000±n/a nM
Citation Smith, ALD'Angelo, NDBo, YYBooker, SKCee, VJHerberich, BHong, FTJackson, CLLanman, BALiu, LNishimura, NPettus, LHReed, ABTadesse, STamayo, NAWurz, RPYang, KAndrews, KLWhittington, DAMcCarter, JDMiguel, TSZalameda, LJiang, JSubramanian, RMullady, ELCaenepeel, SFreeman, DJWang, LZhang, NWu, THughes, PENorman, MH Structure-based design of a novel series of potent, selective inhibitors of the class I phosphatidylinositol 3-kinases. J Med Chem55:5188-219 (2012) 
 
Serine/threonine-protein kinase mTOR
Name:Serine/threonine-protein kinase mTOR
Type:Rapamycin target protein
Mol. Mass.:288917.12
Organism:Homo sapiens (Human)
Description:P42345
Residue:2549
BDBM50394844
NameBDBM50394844
Synonyms:CHEMBL2165019 | US8772480, 224
TypeSmall organic molecule
Emp. Form.C22H28N8O3S
Mol. Mass.484.575
SMILESCOc1ccc(Nc2ncc(CN3CCC(CC3)S(C)(=O)=O)cc2-c2nc(C)nc(N)n2)cn1