Reaction Details
TargetPhosphatidylinositol 4,5-bisphosphate 3-kinase catalytic subunit delta isoform
LigandBDBM50394857
Substrate/Competitorn/a
Meas. Tech.ChEMBL_860485 (CHEMBL2166654)
Ki 6±n/a nM
Citation Smith, ALD'Angelo, NDBo, YYBooker, SKCee, VJHerberich, BHong, FTJackson, CLLanman, BALiu, LNishimura, NPettus, LHReed, ABTadesse, STamayo, NAWurz, RPYang, KAndrews, KLWhittington, DAMcCarter, JDMiguel, TSZalameda, LJiang, JSubramanian, RMullady, ELCaenepeel, SFreeman, DJWang, LZhang, NWu, THughes, PENorman, MH Structure-based design of a novel series of potent, selective inhibitors of the class I phosphatidylinositol 3-kinases. J Med Chem55:5188-219 (2012) 
 
Phosphatidylinositol 4,5-bisphosphate 3-kinase catalytic subunit delta isoform
Name:Phosphatidylinositol 4,5-bisphosphate 3-kinase catalytic subunit delta isoform
Type:Enzyme Subunit
Mol. Mass.:119489.41
Organism:Homo sapiens (Human)
Description:O00329
Residue:1044
BDBM50394857
NameBDBM50394857
Synonyms:CHEMBL2165033 | US8772480, 247
TypeSmall organic molecule
Emp. Form.C19H19N9O
Mol. Mass.389.4139
SMILESCOc1ccc(Nc2ncc(cc2-c2nc(C)nc(N)n2)-c2cnn(C)c2)cn1