Reaction Details
TargetPhosphatidylinositol 4,5-bisphosphate 3-kinase catalytic subunit gamma isoform
LigandBDBM50394844
Substrate/Competitorn/a
Meas. Tech.ChEMBL_860486 (CHEMBL2166655)
Ki 9±n/a nM
Citation Smith, ALD'Angelo, NDBo, YYBooker, SKCee, VJHerberich, BHong, FTJackson, CLLanman, BALiu, LNishimura, NPettus, LHReed, ABTadesse, STamayo, NAWurz, RPYang, KAndrews, KLWhittington, DAMcCarter, JDMiguel, TSZalameda, LJiang, JSubramanian, RMullady, ELCaenepeel, SFreeman, DJWang, LZhang, NWu, THughes, PENorman, MH Structure-based design of a novel series of potent, selective inhibitors of the class I phosphatidylinositol 3-kinases. J Med Chem55:5188-219 (2012) 
 
Phosphatidylinositol 4,5-bisphosphate 3-kinase catalytic subunit gamma isoform
Name:Phosphatidylinositol 4,5-bisphosphate 3-kinase catalytic subunit gamma isoform
Type:Enzyme Subunit
Mol. Mass.:126470.30
Organism:Homo sapiens (Human)
Description:P48736
Residue:1102
BDBM50394844
NameBDBM50394844
Synonyms:CHEMBL2165019 | US8772480, 224
TypeSmall organic molecule
Emp. Form.C22H28N8O3S
Mol. Mass.484.575
SMILESCOc1ccc(Nc2ncc(CN3CCC(CC3)S(C)(=O)=O)cc2-c2nc(C)nc(N)n2)cn1